Reaction Details
TargetPeptide deformylase, mitochondrial
LigandBDBM50542154
Substrate/Competitorn/a
Meas. Tech.ChEMBL_1985989 (CHEMBL4619395)
IC50 5.0±n/a nM
Citation Hu, LCai, XDong, SZhen, YHu, JWang, SJiang, JHuang, JHan, YQian, YYuan, YHu, W Synthesis and Anticancer Activity of Novel Actinonin Derivatives as HsPDF Inhibitors. J Med Chem63:6959-6978 (2020) 
 
Peptide deformylase, mitochondrial
Name:Peptide deformylase, mitochondrial
Type:PROTEIN
Mol. Mass.:27023.25
Organism:Homo sapiens (Human)
Description:ChEMBL_154318
Residue:243
BDBM50542154
NameBDBM50542154
Synonyms:CHEMBL4641416
TypeSmall organic molecule
Emp. Form.C23H28FN5O4
Mol. Mass.457.4979
SMILESONC(=O)C[C@@H](CC1CCCC1)C(=O)N1CC2(CC2)C[C@H]1c1nc(no1)-c1ccc(F)cn1