Reaction Details
TargetPeptide deformylase, mitochondrial
LigandBDBM50542157
Substrate/Competitorn/a
Meas. Tech.ChEMBL_1985989 (CHEMBL4619395)
IC50 8.8±n/a nM
Citation Hu, LCai, XDong, SZhen, YHu, JWang, SJiang, JHuang, JHan, YQian, YYuan, YHu, W Synthesis and Anticancer Activity of Novel Actinonin Derivatives as HsPDF Inhibitors. J Med Chem63:6959-6978 (2020) 
 
Peptide deformylase, mitochondrial
Name:Peptide deformylase, mitochondrial
Type:PROTEIN
Mol. Mass.:27023.25
Organism:Homo sapiens (Human)
Description:ChEMBL_154318
Residue:243
BDBM50542157
NameBDBM50542157
Synonyms:CHEMBL4646467
TypeSmall organic molecule
Emp. Form.C26H34N4O4
Mol. Mass.466.5726
SMILESCCc1ccc(cc1)-c1noc(n1)[C@@H]1CC2(CC2)CN1C(=O)[C@H](CC1CCCC1)CC(=O)NO