Reaction Details
TargetPeptide deformylase, mitochondrial
LigandBDBM50542162
Substrate/Competitorn/a
Meas. Tech.ChEMBL_1985989 (CHEMBL4619395)
IC50 6.5±n/a nM
Citation Hu, LCai, XDong, SZhen, YHu, JWang, SJiang, JHuang, JHan, YQian, YYuan, YHu, W Synthesis and Anticancer Activity of Novel Actinonin Derivatives as HsPDF Inhibitors. J Med Chem63:6959-6978 (2020) 
 
Peptide deformylase, mitochondrial
Name:Peptide deformylase, mitochondrial
Type:PROTEIN
Mol. Mass.:27023.25
Organism:Homo sapiens (Human)
Description:ChEMBL_154318
Residue:243
BDBM50542162
NameBDBM50542162
Synonyms:CHEMBL4645966
TypeSmall organic molecule
Emp. Form.C25H28ClF3N4O4
Mol. Mass.540.962
SMILESONC(=O)C[C@@H](CC1CCCC1)C(=O)N1CC2(CC2)C[C@H]1c1nc(no1)-c1ccc(cc1Cl)C(F)(F)F