Reaction Details
TargetAdenosine receptor A2a
LigandBDBM50542172
Substrate/Competitorn/a
Meas. Tech.ChEMBL_1986036 (CHEMBL4619442)
Ki 1.000000±n/a nM
Citation Mallo-Abreu, APrieto-Díaz, RJespers, WAzuaje, JMajellaro, MVelando, CGarcía-Mera, XCaamaño, OBrea, JLoza, MIGutiérrez-de-Terán, HSotelo, E Nitrogen-Walk Approach to Explore Bioisosteric Replacements in a Series of Potent A J Med Chem63:7721-7739 (2020) 
 
Adenosine receptor A2a
Name:Adenosine receptor A2a
Type:G Protein-Coupled Receptor (GPCR)
Mol. Mass.:44716.46
Organism:Homo sapiens (Human)
Description:P29274
Residue:412
BDBM50542172
NameBDBM50542172
Synonyms:CHEMBL4632760
TypeSmall organic molecule
Emp. Form.C18H18N4O3
Mol. Mass.338.3605
SMILESCC(C)OC(=O)C1=C(C)Nc2nc3ccccc3n2C1c1ncco1