Reaction Details
TargetMitogen-activated protein kinase 14
LigandBDBM50099367
Substrate/Competitorn/a
Meas. Tech.ChEBML_124487
IC50 14±n/a nM
Citation Boehm, JCBower, MJGallagher, TFKassis, SJohnson, SRAdams, JL Phenoxypyrimidine inhibitors of p38alpha kinase: synthesis and statistical evaluation of the p38 inhibitory potencies of a series of 1-(piperidin-4-yl)-4-(4-fluorophenyl)-5-(2-phenoxypyrimidin-4-yl) imidazoles. Bioorg Med Chem Lett11:1123-6 (2001) Mitogen-activated protein kinase 14
Name:Mitogen-activated protein kinase 14
Type:Serine/threonine-protein kinase
Mol. Mass.:41286.76
Organism:Homo sapiens (Human)
Description:Q16539
Residue:360
BDBM50099367
NameBDBM50099367
Synonyms:4-{4-[5-(4-Fluoro-phenyl)-3-piperidin-4-yl-3H-imidazol-4-yl]-pyrimidin-2-yloxy}-phenol | CHEMBL14763
TypeSmall organic molecule
Emp. Form.C24H22FN5O2
Mol. Mass.431.4622
SMILESOc1ccc(Oc2nccc(n2)-c2c(ncn2C2CCNCC2)-c2ccc(F)cc2)cc1