Reaction Details
TargetMitogen-activated protein kinase 14
LigandBDBM50099374
Substrate/Competitorn/a
Meas. Tech.ChEBML_124487
IC50 19±n/a nM
Citation Boehm, JCBower, MJGallagher, TFKassis, SJohnson, SRAdams, JL Phenoxypyrimidine inhibitors of p38alpha kinase: synthesis and statistical evaluation of the p38 inhibitory potencies of a series of 1-(piperidin-4-yl)-4-(4-fluorophenyl)-5-(2-phenoxypyrimidin-4-yl) imidazoles. Bioorg Med Chem Lett11:1123-6 (2001) Mitogen-activated protein kinase 14
Name:Mitogen-activated protein kinase 14
Type:Serine/threonine-protein kinase
Mol. Mass.:41286.76
Organism:Homo sapiens (Human)
Description:Q16539
Residue:360
BDBM50099374
NameBDBM50099374
Synonyms:4-[5-(4-Fluoro-phenyl)-3-piperidin-4-yl-3H-imidazol-4-yl]-2-phenoxy-pyrimidine | CHEMBL275798
TypeSmall organic molecule
Emp. Form.C24H22FN5O
Mol. Mass.415.4628
SMILESFc1ccc(cc1)-c1ncn(C2CCNCC2)c1-c1ccnc(Oc2ccccc2)n1