Reaction Details
TargetParathyroid hormone/parathyroid hormone-related peptide receptor
LigandBDBM50542598
Substrate/Competitorn/a
Meas. Tech.ChEMBL_1987253 (CHEMBL4620800)
IC50 170±n/a nM
Citation Arai, YKiyotsuka, YKagechika, KNishi, TInui, MNagamochi, MOyama, KIzumi, M Discovery of novel, potent, and orally bioavailable pyrido[2,3-d][1]benzazepin-6-one antagonists for parathyroid hormone receptor 1. Bioorg Med Chem28:0 (2020) 
 
Parathyroid hormone/parathyroid hormone-related peptide receptor
Name:Parathyroid hormone/parathyroid hormone-related peptide receptor
Type:Enzyme Catalytic Domain
Mol. Mass.:66370.95
Organism:Homo sapiens (Human)
Description:PARATHYROID HT1 0 HUMAN::Q03431
Residue:593
BDBM50542598
NameBDBM50542598
Synonyms:CHEMBL4647898
TypeSmall organic molecule
Emp. Form.C28H30Cl2N4O2
Mol. Mass.525.469
SMILESCC1(C)c2ncc(Cl)cc2-c2ccc(Cl)cc2N(c2ccc(NCCNC3CCOCC3)cc2)C1=O