Reaction Details
TargetParathyroid hormone/parathyroid hormone-related peptide receptor
LigandBDBM50542603
Substrate/Competitorn/a
Meas. Tech.ChEMBL_1987253 (CHEMBL4620800)
IC50 270±n/a nM
Citation Arai, YKiyotsuka, YKagechika, KNishi, TInui, MNagamochi, MOyama, KIzumi, M Discovery of novel, potent, and orally bioavailable pyrido[2,3-d][1]benzazepin-6-one antagonists for parathyroid hormone receptor 1. Bioorg Med Chem28:0 (2020) 
 
Parathyroid hormone/parathyroid hormone-related peptide receptor
Name:Parathyroid hormone/parathyroid hormone-related peptide receptor
Type:Enzyme Catalytic Domain
Mol. Mass.:66370.95
Organism:Homo sapiens (Human)
Description:PARATHYROID HT1 0 HUMAN::Q03431
Residue:593
BDBM50542603
NameBDBM50542603
Synonyms:CHEMBL4640934
TypeSmall organic molecule
Emp. Form.C29H33ClN4O3
Mol. Mass.521.05
SMILESCOc1ccc-2c(c1)N(c1ccc(NCCNC3CCOCC3)cc1)C(=O)C(C)(C)c1ncc(Cl)cc-21