Reaction Details
TargetParathyroid hormone/parathyroid hormone-related peptide receptor
LigandBDBM50542604
Substrate/Competitorn/a
Meas. Tech.ChEMBL_1987253 (CHEMBL4620800)
IC50 90±n/a nM
Citation Arai, YKiyotsuka, YKagechika, KNishi, TInui, MNagamochi, MOyama, KIzumi, M Discovery of novel, potent, and orally bioavailable pyrido[2,3-d][1]benzazepin-6-one antagonists for parathyroid hormone receptor 1. Bioorg Med Chem28:0 (2020) 
 
Parathyroid hormone/parathyroid hormone-related peptide receptor
Name:Parathyroid hormone/parathyroid hormone-related peptide receptor
Type:Enzyme Catalytic Domain
Mol. Mass.:66370.95
Organism:Homo sapiens (Human)
Description:PARATHYROID HT1 0 HUMAN::Q03431
Residue:593
BDBM50542604
NameBDBM50542604
Synonyms:CHEMBL4642072
TypeSmall organic molecule
Emp. Form.C29H30ClN5O2
Mol. Mass.516.034
SMILESCC1(C)c2ncc(Cl)cc2-c2ccc(cc2N(c2ccc(NCCNC3CCOCC3)cc2)C1=O)C#N