Reaction Details
TargetC-C chemokine receptor type 1
LigandBDBM50099476
Substrate/Competitorn/a
Meas. Tech.ChEBML_40341
IC50 260±n/a nM
Citation Naya, AKobayashi, KIshikawa, MOhwaki, KSaeki, TNoguchi, KOhtake, N Discovery of a novel CCR3 selective antagonist. Bioorg Med Chem Lett11:1219-23 (2001) C-C chemokine receptor type 1
Name:C-C chemokine receptor type 1
Type:Enzyme
Mol. Mass.:41180.69
Organism:Homo sapiens (Human)
Description:P32246
Residue:355
BDBM50099476
NameBDBM50099476
Synonyms:2-(Benzothiazol-2-ylsulfanyl)-N-[1-(4-chloro-benzyl)-piperidin-4-yl]-acetamide | CHEMBL282285
TypeSmall organic molecule
Emp. Form.C21H22ClN3OS2
Mol. Mass.432.002
SMILESClc1ccc(CN2CCC(CC2)NC(=O)CSc2nc3ccccc3s2)cc1