Reaction Details
TargetC-C chemokine receptor type 3
LigandBDBM50099480
Substrate/Competitorn/a
Meas. Tech.ChEBML_40365
IC50 32±n/a nM
Citation Naya, AKobayashi, KIshikawa, MOhwaki, KSaeki, TNoguchi, KOhtake, N Discovery of a novel CCR3 selective antagonist. Bioorg Med Chem Lett11:1219-23 (2001) C-C chemokine receptor type 3
Name:C-C chemokine receptor type 3
Type:Enzyme
Mol. Mass.:41053.88
Organism:Homo sapiens (Human)
Description:P51677
Residue:355
BDBM50099480
NameBDBM50099480
Synonyms:2-(Benzothiazol-2-ylsulfanyl)-N-[1-(3,4-dichloro-benzyl)-piperidin-4-yl]-acetamide | CHEMBL20532
TypeSmall organic molecule
Emp. Form.C21H21Cl2N3OS2
Mol. Mass.466.447
SMILESClc1ccc(CN2CCC(CC2)NC(=O)CSc2nc3ccccc3s2)cc1Cl