Reaction Details
TargetD(3) dopamine receptor
LigandBDBM50099815
Substrate/Competitorn/a
Meas. Tech.ChEMBL_62749 (CHEMBL674590)
Ki 3.2±n/a nM
Citation Huang, YLuedtke, RRFreeman, RAWu, LMach, RH Synthesis and structure-activity relationships of naphthamides as dopamine D3 receptor ligands. J Med Chem44:1815-26 (2001) D(3) dopamine receptor
Name:D(3) dopamine receptor
Type:Protein
Mol. Mass.:49540.58
Organism:Rattus norvegicus (Rat)
Description:P19020
Residue:446
BDBM50099815
NameBDBM50099815
Synonyms:4-Bromo-1-methoxy-naphthalene-2-carboxylic acid ((R)-1-cyclohexyl-pyrrolidin-2-ylmethyl)-amide CHEMBL53038
TypeSmall organic molecule
Emp. Form.C23H29BrN2O2
Mol. Mass.445.393
SMILESCOc1c(cc(Br)c2ccccc12)C(=O)NC[C@H]1CCCN1C1CCCCC1