Reaction Details
TargetSigma non-opioid intracellular receptor 1
LigandBDBM50099808
Substrate/Competitorn/a
Meas. Tech.ChEMBL_202070 (CHEMBL811340)
Ki 1.1±n/a nM
Citation Huang, YLuedtke, RRFreeman, RAWu, LMach, RH Synthesis and structure-activity relationships of naphthamides as dopamine D3 receptor ligands. J Med Chem44:1815-26 (2001) Sigma non-opioid intracellular receptor 1
Name:Sigma non-opioid intracellular receptor 1
Type:Enzyme Catalytic Domain
Mol. Mass.:25124.85
Organism:Homo sapiens (Human)
Description:Q99720
Residue:223
BDBM50099808
NameBDBM50099808
Synonyms:4-Bromo-1-methoxy-naphthalene-2-carboxylic acid (1-cyclohexyl-piperidin-4-yl)-amide | CHEMBL51856
TypeSmall organic molecule
Emp. Form.C23H29BrN2O2
Mol. Mass.445.393
SMILESCOc1c(cc(Br)c2ccccc12)C(=O)NC1CCN(CC1)C1CCCCC1