Reaction Details
TargetSigma non-opioid intracellular receptor 1
LigandBDBM50099820
Substrate/Competitorn/a
Meas. Tech.ChEMBL_202070 (CHEMBL811340)
Ki 1.2±n/a nM
Citation Huang, YLuedtke, RRFreeman, RAWu, LMach, RH Synthesis and structure-activity relationships of naphthamides as dopamine D3 receptor ligands. J Med Chem44:1815-26 (2001) Sigma non-opioid intracellular receptor 1
Name:Sigma non-opioid intracellular receptor 1
Type:Enzyme Catalytic Domain
Mol. Mass.:25124.85
Organism:Homo sapiens (Human)
Description:Q99720
Residue:223
BDBM50099820
NameBDBM50099820
Synonyms:4-Bromo-1-methoxy-naphthalene-2-carboxylic acid (1-cyclopentyl-piperidin-4-yl)-amide | CHEMBL54092
TypeSmall organic molecule
Emp. Form.C22H27BrN2O2
Mol. Mass.431.366
SMILESCOc1c(cc(Br)c2ccccc12)C(=O)NC1CCN(CC1)C1CCCC1