Reaction Details
TargetD(3) dopamine receptor
LigandBDBM50099807
Substrate/Competitorn/a
Meas. Tech.ChEMBL_62749 (CHEMBL674590)
Ki 0.04±n/a nM
Citation Huang, YLuedtke, RRFreeman, RAWu, LMach, RH Synthesis and structure-activity relationships of naphthamides as dopamine D3 receptor ligands. J Med Chem44:1815-26 (2001) D(3) dopamine receptor
Name:D(3) dopamine receptor
Type:Protein
Mol. Mass.:49540.58
Organism:Rattus norvegicus (Rat)
Description:P19020
Residue:446
BDBM50099807
NameBDBM50099807
Synonyms:CHEMBL54866 | N-(9-Benzyl-9-aza-bicyclo[3.3.1]non-3-yl)-5-iodo-2,3-dimethoxy-benzamide
TypeSmall organic molecule
Emp. Form.C24H29IN2O3
Mol. Mass.520.4031
SMILESCOc1cc(I)cc(C(=O)NC2CC3CCCC(C2)N3Cc2ccccc2)c1OC