Reaction Details
TargetD(3) dopamine receptor
LigandBDBM50099893
Substrate/Competitorn/a
Meas. Tech.ChEBML_62768
Ki>10000±n/a nM
Citation Huang, YKegeles, LSBae, SHwang, DRoth, BLSavage, JELaruelle, M Synthesis of potent and selective dopamine D(4) antagonists as candidate radioligands. Bioorg Med Chem Lett11:1375-7 (2001) D(3) dopamine receptor
Name:D(3) dopamine receptor
Type:Protein
Mol. Mass.:49540.58
Organism:Rattus norvegicus (Rat)
Description:P19020
Residue:446
BDBM50099893
NameBDBM50099893
Synonyms:3-[4-(4-Fluoro-phenyl)-piperazin-1-ylmethyl]-1H-pyrrolo[2,3-b]pyridine | CHEMBL28997
TypeSmall organic molecule
Emp. Form.C18H19FN4
Mol. Mass.310.3687
SMILESFc1ccc(cc1)N1CCN(Cc2c[nH]c3ncccc23)CC1