Reaction Details
TargetMuscarinic acetylcholine receptor M4
LigandBDBM85093
Substrate/Competitorn/a
Meas. Tech.ChEBML_139258
Ki>10000±n/a nM
Citation Huang, YKegeles, LSBae, SHwang, DRoth, BLSavage, JELaruelle, M Synthesis of potent and selective dopamine D(4) antagonists as candidate radioligands. Bioorg Med Chem Lett11:1375-7 (2001) Muscarinic acetylcholine receptor M4
Name:Muscarinic acetylcholine receptor M4
Type:Enzyme Catalytic Domain
Mol. Mass.:53079.31
Organism:Homo sapiens (Human)
Description:Cholinergic, muscarinic M4 CHRM4 HUMAN M3::P08173
Residue:479
BDBM85093
NameBDBM85093
Synonyms:CAS_3853 CHEMBL555670 NSC_3853
TypeSmall organic molecule
Emp. Form.C18H19ClN4
Mol. Mass.326.823
SMILESClc1ccc(cc1)N1CCN(Cc2c[nH]c3ncccc23)CC1