Reaction Details
TargetD(2) dopamine receptor
LigandBDBM50099890
Substrate/Competitorn/a
Meas. Tech.ChEBML_62878
Ki 438±n/a nM
Citation Huang, YKegeles, LSBae, SHwang, DRoth, BLSavage, JELaruelle, M Synthesis of potent and selective dopamine D(4) antagonists as candidate radioligands. Bioorg Med Chem Lett11:1375-7 (2001) D(2) dopamine receptor
Name:D(2) dopamine receptor
Type:G Protein-Coupled Receptor (GPCR)
Mol. Mass.:50931.60
Organism:Rattus norvegicus (rat)
Description:P61169
Residue:444
BDBM50099890
NameBDBM50099890
Synonyms:3-[4-(2-Methoxy-phenyl)-piperazin-1-ylmethyl]-1H-pyrrolo[2,3-b]pyridine | CHEMBL435949
TypeSmall organic molecule
Emp. Form.C19H22N4O
Mol. Mass.322.4042
SMILESCOc1ccccc1N1CCN(Cc2c[nH]c3ncccc23)CC1