Reaction Details
Target5-hydroxytryptamine receptor 2A
LigandBDBM50099888
Substrate/Competitorn/a
Meas. Tech.ChEBML_2294
Ki 627±n/a nM
Citation Huang, YKegeles, LSBae, SHwang, DRoth, BLSavage, JELaruelle, M Synthesis of potent and selective dopamine D(4) antagonists as candidate radioligands. Bioorg Med Chem Lett11:1375-7 (2001) 5-hydroxytryptamine receptor 2A
Name:5-hydroxytryptamine receptor 2A
Type:undefined
Mol. Mass.:52607.65
Organism:Homo sapiens (Human)
Description:P28223
Residue:471
BDBM50099888
NameBDBM50099888
Synonyms:3-[4-(4-Ethyl-phenyl)-piperazin-1-ylmethyl]-1H-pyrrolo[2,3-b]pyridine | CHEMBL282829
TypeSmall organic molecule
Emp. Form.C20H24N4
Mol. Mass.320.4314
SMILESCCc1ccc(cc1)N1CCN(Cc2c[nH]c3ncccc23)CC1