Reaction Details
TargetLysosomal acid glucosylceramidase
LigandBDBM50100426
Substrate/Competitorn/a
Meas. Tech.ChEBML_37419
Ki 2.4±n/a nM
Citation Hermetter, AScholze, HStütz, AEWithers, SGWrodnigg, TM Powerful probes for glycosidases: novel, fluorescently tagged glycosidase inhibitors. Bioorg Med Chem Lett11:1339-42 (2001) Lysosomal acid glucosylceramidase
Name:Lysosomal acid glucosylceramidase
Type:Enzyme
Mol. Mass.:59724.64
Organism:Homo sapiens (Human)
Description:The beta-Glu activity was measured with commercially available beta-glucocerebrosidase (Ceredase) as the enzyme source.
Residue:536
BDBM50100426
NameBDBM50100426
Synonyms:5-Dimethylamino-naphthalene-1-sulfonic acid ((3S,4S,5R)-3,4-dihydroxy-5-hydroxymethyl-pyrrolidin-2-ylmethyl)-amide | CHEMBL3349996
TypeSmall organic molecule
Emp. Form.C18H25N3O5S
Mol. Mass.395.473
SMILESCN(C)c1cccc2c(cccc12)S(=O)(=O)NC[C@H]1N[C@H](CO)[C@H](O)[C@@H]1O