Reaction Details
TargetAdenosine kinase
LigandBDBM50100587
Substrate/Competitorn/a
Meas. Tech.ChEMBL_31125 (CHEMBL643553)
IC50 2000±n/a nM
Citation Lee, CHJiang, MCowart, MGfesser, GPerner, RKim, KHGu, YGWilliams, MJarvis, MFKowaluk, EAStewart, AOBhagwat, SS Discovery of 4-amino-5-(3-bromophenyl)-7-(6-morpholino-pyridin-3-yl)pyrido[2,3-d]pyrimidine, an orally active, non-nucleoside adenosine kinase inhibitor.. J Med Chem44:2133-8 (2001) Adenosine kinase
Name:Adenosine kinase
Type:Enzyme
Mol. Mass.:40130.14
Organism:Rattus norvegicus (rat)
Description:Rat brain cytosol as enzyme source.
Residue:361
BDBM50100587
NameBDBM50100587
Synonyms:(2R,3R,4S,5R)-2-(6-Amino-5-nitro-pyrimidin-4-ylamino)-5-hydroxymethyl-tetrahydro-furan-3,4-diol CHEMBL304179
TypeSmall organic molecule
Emp. Form.C9H13N5O6
Mol. Mass.287.2294
SMILESNc1ncnc(N[C@@H]2O[C@H](CO)[C@@H](O)[C@H]2O)c1[N+]([O-])=O