Reaction Details
TargetSodium channel subunit beta-2
LigandBDBM258146
Substrate/Competitorn/a
Meas. Tech.ChEMBL_1990086 (CHEMBL4623821)
IC50 26.5±n/a nM
Citation Shinozuka, TKobayashi, HSuzuki, STanaka, KKaranjule, NHayashi, NTsuda, TTokumaru, EInoue, MUeda, KKimoto, HDomon, YTakahashi, SKubota, KYokoyama, TShimizugawa, AKoishi, RFujiwara, CAsano, DSakakura, TTakasuna, KAbe, YWatanabe, TKitano, Y Discovery of DS-1971a, a Potent, Selective Na J Med Chem63:10204-10220 (2020) 
 
Sodium channel subunit beta-2
Name:Sodium channel subunit beta-2
Type:PROTEIN
Mol. Mass.:24227.48
Organism:Mus musculus
Description:ChEMBL_119885
Residue:215
BDBM258146
NameBDBM258146
Synonyms:US9493448, 122 US9493448, 48 US9845313, Example 154
TypeSmall organic molecule
Emp. Form.C20H21ClFN5O3S
Mol. Mass.465.929
SMILESCn1nccc1[C@H]1CCCC[C@@H]1Oc1cc(F)c(cc1Cl)S(=O)(=O)Nc1ccncn1