Reaction Details
TargetGonadotropin-releasing hormone receptor
LigandBDBM50101179
Substrate/Competitorn/a
Meas. Tech.ChEMBL_71606 (CHEMBL689138)
IC50 0.400000±n/a nM
Citation Ashton, WTSisco, RMYang, YTLo, JLYudkovitz, JBCheng, KGoulet, MT Substituted indole-5-carboxamides and -acetamides as potent nonpeptide GnRH receptor antagonists. Bioorg Med Chem Lett11:1723-6 (2001) Gonadotropin-releasing hormone receptor
Name:Gonadotropin-releasing hormone receptor
Type:PROTEIN
Mol. Mass.:37767.60
Organism:Rattus norvegicus
Description:ChEMBL_1335047
Residue:327
BDBM50101179
NameBDBM50101179
Synonyms:2-(2-(3,5-Dimethyl-phenyl)-3-{2-[4-(4-methanesulfonylamino-phenyl)-butylamino]-ethyl}-1H-indol-5-yl)-N,N-dipropyl-isobutyramide | CHEMBL297430
TypeSmall organic molecule
Emp. Form.C39H54N4O3S
Mol. Mass.658.936
SMILESCCCN(CCC)C(=O)C(C)(C)c1ccc2[nH]c(c(CCNCCCCc3ccc(NS(C)(=O)=O)cc3)c2c1)-c1cc(C)cc(C)c1