Reaction Details
TargetGonadotropin-releasing hormone receptor
LigandBDBM50101169
Substrate/Competitorn/a
Meas. Tech.ChEMBL_71606 (CHEMBL689138)
IC50 0.200000±n/a nM
Citation Ashton, WTSisco, RMYang, YTLo, JLYudkovitz, JBCheng, KGoulet, MT Substituted indole-5-carboxamides and -acetamides as potent nonpeptide GnRH receptor antagonists. Bioorg Med Chem Lett11:1723-6 (2001) Gonadotropin-releasing hormone receptor
Name:Gonadotropin-releasing hormone receptor
Type:PROTEIN
Mol. Mass.:37767.60
Organism:Rattus norvegicus
Description:ChEMBL_1335047
Residue:327
BDBM50101169
NameBDBM50101169
Synonyms:2-(2-(3,5-Dimethyl-phenyl)-3-{2-[4-(4-methanesulfonylamino-phenyl)-butylamino]-ethyl}-1H-indol-5-yl)-N,N-diethyl-isobutyramide | CHEMBL265774
TypeSmall organic molecule
Emp. Form.C37H50N4O3S
Mol. Mass.630.883
SMILESCCN(CC)C(=O)C(C)(C)c1ccc2[nH]c(c(CCNCCCCc3ccc(NS(C)(=O)=O)cc3)c2c1)-c1cc(C)cc(C)c1