Reaction Details
TargetGonadotropin-releasing hormone receptor
LigandBDBM50101238
Substrate/Competitorn/a
Meas. Tech.ChEMBL_71604 (CHEMBL689136)
IC50 0.400000±n/a nM
Citation Ashton, WTSisco, RMYang, YTLo, JLYudkovitz, JBGibbons, PHMount, GRRen, RNButler, BSCheng, KGoulet, MT Potent nonpeptide GnRH receptor antagonists derived from substituted indole-5-carboxamides and -acetamides bearing a pyridine side-chain terminus. Bioorg Med Chem Lett11:1727-31 (2001) Gonadotropin-releasing hormone receptor
Name:Gonadotropin-releasing hormone receptor
Type:PROTEIN
Mol. Mass.:37767.60
Organism:Rattus norvegicus
Description:ChEMBL_1335047
Residue:327
BDBM50101238
NameBDBM50101238
Synonyms:CHEMBL417726 | {2-(3,5-Dimethyl-phenyl)-3-[2-(4-pyridin-3-yl-butylamino)-ethyl]-1H-indol-5-yl}-morpholin-4-yl-methanone
TypeSmall organic molecule
Emp. Form.C32H38N4O2
Mol. Mass.510.6697
SMILESCc1cc(C)cc(c1)-c1[nH]c2ccc(cc2c1CCNCCCCc1cccnc1)C(=O)N1CCOCC1