Reaction Details
TargetGonadotropin-releasing hormone receptor
LigandBDBM50101242
Substrate/Competitorn/a
Meas. Tech.ChEMBL_71728 (CHEMBL680407)
IC50 340±n/a nM
Citation Ashton, WTSisco, RMYang, YTLo, JLYudkovitz, JBGibbons, PHMount, GRRen, RNButler, BSCheng, KGoulet, MT Potent nonpeptide GnRH receptor antagonists derived from substituted indole-5-carboxamides and -acetamides bearing a pyridine side-chain terminus. Bioorg Med Chem Lett11:1727-31 (2001) Gonadotropin-releasing hormone receptor
Name:Gonadotropin-releasing hormone receptor
Type:PROTEIN
Mol. Mass.:37767.60
Organism:Rattus norvegicus
Description:ChEMBL_1335047
Residue:327
BDBM50101242
NameBDBM50101242
Synonyms:CHEMBL296483 | {2-(3,5-Dimethyl-phenyl)-3-[2-(4-pyridin-4-yl-butylamino)-ethyl]-1H-indol-5-yl}-(2,5-dimethyl-pyrrolidin-1-yl)-methanone
TypeSmall organic molecule
Emp. Form.C34H42N4O
Mol. Mass.522.7235
SMILESCC1CCC(C)N1C(=O)c1ccc2[nH]c(c(CCNCCCCc3ccncc3)c2c1)-c1cc(C)cc(C)c1