Reaction Details
TargetDelta-type opioid receptor
LigandBDBM50101614
Substrate/Competitorn/a
Meas. Tech.ChEMBL_145325 (CHEMBL750413)
IC50 0.220000±n/a nM
Citation Pagé, DNaismith, ASchmidt, RCoupal, MLabarre, MGosselin, MBellemare, DPayza, KBrown, W Novel C-terminus modifications of the Dmt-Tic motif: a new class of dipeptide analogues showing altered pharmacological profiles toward the opioid receptors. J Med Chem44:2387-90 (2001) Delta-type opioid receptor
Name:Delta-type opioid receptor
Type:G Protein-Coupled Receptor (GPCR)
Mol. Mass.:40382.98
Organism:Homo sapiens (Human)
Description:Competition binding assays were carried out using membrane preparations from transfected HN9.10 cells that constitutively expressed the delta opioid receptor.
Residue:372
BDBM50101614
NameBDBM50101614
Synonyms:1-{2-[2-Amino-3-(4-hydroxy-2,6-dimethyl-phenyl)-propionyl]-1,2,3,4-tetrahydro-isoquinolin-3-ylmethyl}-3-tert-butyl-thiourea | CHEMBL421520
TypeSmall organic molecule
Emp. Form.C26H36N4O2S
Mol. Mass.468.655
SMILESCc1cc(O)cc(C)c1C[C@H](N)C(=O)N1Cc2ccccc2C[C@H]1CNC(=S)NC(C)(C)C