Reaction Details
TargetDelta-type opioid receptor
LigandBDBM50101610
Substrate/Competitorn/a
Meas. Tech.ChEMBL_145196 (CHEMBL756059)
EC50 2.8±n/a nM
Citation Pagé, DNaismith, ASchmidt, RCoupal, MLabarre, MGosselin, MBellemare, DPayza, KBrown, W Novel C-terminus modifications of the Dmt-Tic motif: a new class of dipeptide analogues showing altered pharmacological profiles toward the opioid receptors. J Med Chem44:2387-90 (2001) Delta-type opioid receptor
Name:Delta-type opioid receptor
Type:G Protein-Coupled Receptor (GPCR)
Mol. Mass.:40382.98
Organism:Homo sapiens (Human)
Description:Competition binding assays were carried out using membrane preparations from transfected HN9.10 cells that constitutively expressed the delta opioid receptor.
Residue:372
BDBM50101610
NameBDBM50101610
Synonyms:2-Amino-1-{3-[(2,2-dimethyl-propylamino)-methyl]-3,4-dihydro-1H-isoquinolin-2-yl}-3-(4-hydroxy-2,6-dimethyl-phenyl)-propan-1-one | CHEMBL76573
TypeSmall organic molecule
Emp. Form.C26H37N3O2
Mol. Mass.423.5909
SMILESCc1cc(O)cc(C)c1C[C@H](N)C(=O)N1Cc2ccccc2C[C@H]1CNCC(C)(C)C