Reaction Details
TargetMu-type opioid receptor
LigandBDBM50101615
Substrate/Competitorn/a
Meas. Tech.ChEMBL_149485 (CHEMBL758076)
IC50 83±n/a nM
Citation Pagé, DNaismith, ASchmidt, RCoupal, MLabarre, MGosselin, MBellemare, DPayza, KBrown, W Novel C-terminus modifications of the Dmt-Tic motif: a new class of dipeptide analogues showing altered pharmacological profiles toward the opioid receptors. J Med Chem44:2387-90 (2001) Mu-type opioid receptor
Name:Mu-type opioid receptor
Type:G Protein-Coupled Receptor (GPCR)
Mol. Mass.:44789.51
Organism:Homo sapiens (Human)
Description:P35372
Residue:400
BDBM50101615
NameBDBM50101615
Synonyms:2-Amino-1-(3-dimethylaminomethyl-3,4-dihydro-1H-isoquinolin-2-yl)-3-(4-hydroxy-2,6-dimethyl-phenyl)-propan-1-one | CHEMBL80464
TypeSmall organic molecule
Emp. Form.C23H31N3O2
Mol. Mass.381.5111
SMILESCN(C)C[C@@H]1Cc2ccccc2CN1C(=O)[C@@H](N)Cc1c(C)cc(O)cc1C