Reaction Details
TargetKappa-type opioid receptor
LigandBDBM50101616
Substrate/Competitorn/a
Meas. Tech.ChEMBL_147230 (CHEMBL754918)
IC50 1450±n/a nM
Citation Pagé, DNaismith, ASchmidt, RCoupal, MLabarre, MGosselin, MBellemare, DPayza, KBrown, W Novel C-terminus modifications of the Dmt-Tic motif: a new class of dipeptide analogues showing altered pharmacological profiles toward the opioid receptors. J Med Chem44:2387-90 (2001) Kappa-type opioid receptor
Name:Kappa-type opioid receptor
Type:G Protein-Coupled Receptor (GPCR)
Mol. Mass.:42648.76
Organism:Homo sapiens (Human)
Description:P41145
Residue:380
BDBM50101616
NameBDBM50101616
Synonyms:1-(3-Allyloxymethyl-3,4-dihydro-1H-isoquinolin-2-yl)-2-amino-3-(4-hydroxy-2,6-dimethyl-phenyl)-propan-1-one | CHEMBL80319
TypeSmall organic molecule
Emp. Form.C24H30N2O3
Mol. Mass.394.5066
SMILESCc1cc(O)cc(C)c1C[C@H](N)C(=O)N1Cc2ccccc2C[C@H]1COCC=C