Reaction Details
TargetMu-type opioid receptor
LigandBDBM50101621
Substrate/Competitorn/a
Meas. Tech.ChEMBL_149485 (CHEMBL758076)
IC50 421±n/a nM
Citation Pagé, DNaismith, ASchmidt, RCoupal, MLabarre, MGosselin, MBellemare, DPayza, KBrown, W Novel C-terminus modifications of the Dmt-Tic motif: a new class of dipeptide analogues showing altered pharmacological profiles toward the opioid receptors. J Med Chem44:2387-90 (2001) Mu-type opioid receptor
Name:Mu-type opioid receptor
Type:G Protein-Coupled Receptor (GPCR)
Mol. Mass.:44789.51
Organism:Homo sapiens (Human)
Description:P35372
Residue:400
BDBM50101621
NameBDBM50101621
Synonyms:2-Amino-3-(4-hydroxy-2,6-dimethyl-phenyl)-1-(3-hydroxymethyl-3,4-dihydro-1H-isoquinolin-2-yl)-propan-1-one | CHEMBL308128
TypeSmall organic molecule
Emp. Form.C21H26N2O3
Mol. Mass.354.4427
SMILESCc1cc(O)cc(C)c1C[C@H](N)C(=O)N1Cc2ccccc2C[C@H]1CO