Reaction Details
TargetKappa-type opioid receptor
LigandBDBM50101613
Substrate/Competitorn/a
Meas. Tech.ChEMBL_147230 (CHEMBL754918)
IC50 4.8±n/a nM
Citation Pagé, DNaismith, ASchmidt, RCoupal, MLabarre, MGosselin, MBellemare, DPayza, KBrown, W Novel C-terminus modifications of the Dmt-Tic motif: a new class of dipeptide analogues showing altered pharmacological profiles toward the opioid receptors. J Med Chem44:2387-90 (2001) Kappa-type opioid receptor
Name:Kappa-type opioid receptor
Type:G Protein-Coupled Receptor (GPCR)
Mol. Mass.:42648.76
Organism:Homo sapiens (Human)
Description:P41145
Residue:380
BDBM50101613
NameBDBM50101613
Synonyms:1-{2-[2-Amino-3-(4-hydroxy-2,6-dimethyl-phenyl)-propionyl]-1,2,3,4-tetrahydro-isoquinolin-3-ylmethyl}-3-phenyl-urea | CHEMBL80463
TypeSmall organic molecule
Emp. Form.C28H32N4O3
Mol. Mass.472.5787
SMILESCc1cc(O)cc(C)c1C[C@H](N)C(=O)N1Cc2ccccc2C[C@H]1CNC(=O)Nc1ccccc1