Reaction Details
TargetProtein farnesyltransferase subunit beta/geranylgeranyltransferase type-1 subunit alpha
LigandBDBM50101923
Substrate/Competitorn/a
Meas. Tech.ChEBML_70446
IC50 1.2±n/a nM
Citation Beshore, DCBell, IMDinsmore, CJHomnick, CFCulberson, JCRobinson, RGFernandes, CWalsh, ESAbrams, MTBhimnathwala, HGDavide, JPEllis-Hutchings, MSHuber, HAKoblan, KSBuser, CAKohl, NELobell, RBChen, IWMcLoughlin, DAOlah, TVGraham, SLHartman, GDWilliams, TM Evaluation of amino acid-based linkers in potent macrocyclic inhibitors of farnesyl-protein transferase. Bioorg Med Chem Lett11:1817-21 (2001) Protein farnesyltransferase subunit beta/geranylgeranyltransferase type-1 subunit alpha
Name:Protein farnesyltransferase subunit beta/geranylgeranyltransferase type-1 subunit alpha
Type:Protein Complex
Mol. Mass.:n/a
Description:To express recombinant enzyme in E. coli, the cloned human alpha and beta subunits were co-expressed from a plasmid, in which their expression was translationally coupled.
Components:This complex has 2 components.
Component 1
Name:Protein farnesyltransferase subunit beta
Synonyms:CAAX farnesyltransferase subunit alpha FNTB FTase-alpha GGTase-I-alpha Protein farnesyl/geranylgeranyl transferase Protein farnesyltransferase subunit beta Protein farnesyltransferase/geranylgeranyltransferase type-1 subunit alpha Ras proteins prenyltransferase subunit beta | Type I protein geranyl-geranyltransferase subunit alpha
Type:Enzyme Subunit
Mol. Mass.:48766.02
Organism:Homo sapiens (Human)
Description:Protein farnesyltransferase subunit beta
Residue:437
Component 2
Name:Protein farnesyltransferase/geranylgeranyltransferase type-1 subunit alpha
Synonyms:CAAX farnesyltransferase alpha subunit FNTA_HUMAN FTase-alpha Geranylgeranyl Transferase (GGTase-I) Chain A Protein Farnesyltransferase (PFT) Chain A Protein farnesyltransferase Protein farnesyltransferase/geranylgeranyltransferase type I alpha subunit | Ras proteins prenyltransferase alpha
Type:Enzyme
Mol. Mass.:44392.46
Organism:Homo sapiens (Human)
Description:Recombinant human FTase.
Residue:379
BDBM50101923
NameBDBM50101923
Synonyms:16-ethyl-17-oxo-(16R)-2-oxa-9,11,15,18-tetraazapentacyclo[17.6.2.13,7.09,13.023,27]octacosa-1(26),3,5,7(28),10,12,19(27),20,22,24-decaen-4-yl cyanide | CHEMBL423303
TypeSmall organic molecule
Emp. Form.C26H23N5O2
Mol. Mass.437.4931
SMILESCC[C@H]1NCc2cncn2Cc2ccc(C#N)c(Oc3ccc4cccc(NC1=O)c4c3)c2