Reaction Details
TargetC-X-C chemokine receptor type 2
LigandBDBM50102219
Substrate/Competitorn/a
Meas. Tech.ChEBML_39662
IC50 130±n/a nM
Citation Cutshall, NSUrsino, RKucera, KALatham, JIhle, NC Nicotinamide N-oxides as CXCR2 antagonists. Bioorg Med Chem Lett11:1951-4 (2001) C-X-C chemokine receptor type 2
Name:C-X-C chemokine receptor type 2
Type:Protein
Mol. Mass.:40767.88
Organism:Homo sapiens (Human)
Description:P25025
Residue:360
BDBM50102219
NameBDBM50102219
Synonyms:CHEMBL61835 | N-(4-Fluoro-phenyl)-6-methanesulfonyl-1-oxy-nicotinamide
TypeSmall organic molecule
Emp. Form.C13H11FN2O4S
Mol. Mass.310.301
SMILESCS(=O)(=O)c1ccc(c[n+]1[O-])C(=O)Nc1ccc(F)cc1