Reaction Details
TargetC-X-C chemokine receptor type 2
LigandBDBM50102224
Substrate/Competitorn/a
Meas. Tech.ChEBML_39662
IC50>20000±n/a nM
Citation Cutshall, NSUrsino, RKucera, KALatham, JIhle, NC Nicotinamide N-oxides as CXCR2 antagonists. Bioorg Med Chem Lett11:1951-4 (2001) C-X-C chemokine receptor type 2
Name:C-X-C chemokine receptor type 2
Type:Protein
Mol. Mass.:40767.88
Organism:Homo sapiens (Human)
Description:P25025
Residue:360
BDBM50102224
NameBDBM50102224
Synonyms:6-Chloro-N-(4-iodo-phenyl)-1-oxy-nicotinamide | CHEMBL58561
TypeSmall organic molecule
Emp. Form.C12H8ClIN2O2
Mol. Mass.374.562
SMILES[O-][n+]1cc(ccc1Cl)C(=O)Nc1ccc(I)cc1