Reaction Details
TargetStromelysin-1
LigandBDBM50103096
Substrate/Competitorn/a
Meas. Tech.ChEMBL_104569 (CHEMBL714852)
Ki 80±n/a nM
Citation Musso, DLAndersen, MWAndrews, RCAustin, RBeaudet, EJBecherer, JDBubacz, DGBickett, DMChan, JHConway, JGCowan, DJGaul, MDGlennon, KCHedeen, KMLambert, MHLeesnitzer, MAMcDougald, DLMitchell, JLMoss, MLRabinowitz, MHRizzolio, MCSchaller, LTStanford, JBTippin, TWarner, JRWhitesell, LGWiethe, RW N-hydroxyformamide peptidomimetics as TACE/matrix metalloprotease inhibitors: oral activity via P1' isobutyl substitution. Bioorg Med Chem Lett11:2147-51 (2001) Stromelysin-1
Name:Stromelysin-1
Type:Enzyme
Mol. Mass.:53973.13
Organism:Homo sapiens (Human)
Description: P08254
Residue:477
BDBM50103096
NameBDBM50103096
Synonyms:(R)-2-[(S)-1-(Formyl-hydroxy-amino)-ethyl]-4-methyl-pentanoic acid [3-methyl-1-(thiazol-2-ylcarbamoyl)-butyl]-amide | CHEMBL66181
TypeSmall organic molecule
Emp. Form.C18H30N4O4S
Mol. Mass.398.52
SMILESCC(C)C[C@H](NC(=O)[C@H](CC(C)C)[C@H](C)N(O)C=O)C(=O)Nc1nccs1