Reaction Details
TargetStromelysin-1
LigandBDBM50063920
Substrate/Competitorn/a
Meas. Tech.ChEMBL_104901 (CHEMBL713437)
Ki 310±n/a nM
Citation Musso, DLAndersen, MWAndrews, RCAustin, RBeaudet, EJBecherer, JDBubacz, DGBickett, DMChan, JHConway, JGCowan, DJGaul, MDGlennon, KCHedeen, KMLambert, MHLeesnitzer, MAMcDougald, DLMitchell, JLMoss, MLRabinowitz, MHRizzolio, MCSchaller, LTStanford, JBTippin, TWarner, JRWhitesell, LGWiethe, RW N-hydroxyformamide peptidomimetics as TACE/matrix metalloprotease inhibitors: oral activity via P1' isobutyl substitution. Bioorg Med Chem Lett11:2147-51 (2001) Stromelysin-1
Name:Stromelysin-1
Type:Enzyme
Mol. Mass.:53973.13
Organism:Homo sapiens (Human)
Description: P08254
Residue:477
BDBM50063920
NameBDBM50063920
Synonyms:(R)-N*1*-((S)-2,2-Dimethyl-1-methylcarbamoyl-propyl)-N*4*-hydroxy-2-isobutyl-succinamide CHEMBL16520 | Ro-31-9790
TypeSmall organic molecule
Emp. Form.C15H29N3O4
Mol. Mass.315.4085
SMILESCNC(=O)[C@@H](NC(=O)[C@H](CC(C)C)CC(=O)NO)C(C)(C)C