Reaction Details
TargetDisintegrin and metalloproteinase domain-containing protein 17
LigandBDBM50103097
Substrate/Competitorn/a
Meas. Tech.ChEBML_207455
Ki 16±n/a nM
Citation Musso, DLAndersen, MWAndrews, RCAustin, RBeaudet, EJBecherer, JDBubacz, DGBickett, DMChan, JHConway, JGCowan, DJGaul, MDGlennon, KCHedeen, KMLambert, MHLeesnitzer, MAMcDougald, DLMitchell, JLMoss, MLRabinowitz, MHRizzolio, MCSchaller, LTStanford, JBTippin, TWarner, JRWhitesell, LGWiethe, RW N-hydroxyformamide peptidomimetics as TACE/matrix metalloprotease inhibitors: oral activity via P1' isobutyl substitution. Bioorg Med Chem Lett11:2147-51 (2001) Disintegrin and metalloproteinase domain-containing protein 17
Name:Disintegrin and metalloproteinase domain-containing protein 17
Type:Enzyme
Mol. Mass.:93007.89
Organism:Homo sapiens (Human)
Description:
Residue:824
BDBM50103097
NameBDBM50103097
Synonyms:(2R,3S)-3-(Formyl-hydroxy-amino)-2-isobutyl-pentanoic acid [2,2-dimethyl-1-(thiazol-2-ylcarbamoyl)-propyl]-amide | CHEMBL304295
TypeSmall organic molecule
Emp. Form.C19H32N4O4S
Mol. Mass.412.547
SMILESCC[C@@H]([C@@H](CC(C)C)C(=O)N[C@H](C(=O)Nc1nccs1)C(C)(C)C)N(O)C=O