Reaction Details
TargetInterstitial collagenase
LigandBDBM50103099
Substrate/Competitorn/a
Meas. Tech.ChEBML_105944
Ki 42±n/a nM
Citation Musso, DLAndersen, MWAndrews, RCAustin, RBeaudet, EJBecherer, JDBubacz, DGBickett, DMChan, JHConway, JGCowan, DJGaul, MDGlennon, KCHedeen, KMLambert, MHLeesnitzer, MAMcDougald, DLMitchell, JLMoss, MLRabinowitz, MHRizzolio, MCSchaller, LTStanford, JBTippin, TWarner, JRWhitesell, LGWiethe, RW N-hydroxyformamide peptidomimetics as TACE/matrix metalloprotease inhibitors: oral activity via P1' isobutyl substitution. Bioorg Med Chem Lett11:2147-51 (2001) Interstitial collagenase
Name:Interstitial collagenase
Type:Enzyme
Mol. Mass.:54010.26
Organism:Homo sapiens (Human)
Description: P03956
Residue:469
BDBM50103099
NameBDBM50103099
Synonyms:(2R,3S)-3-(Formyl-hydroxy-amino)-2-isobutyl-pentanoic acid [(S)-2-methyl-1-(thiazol-2-ylcarbamoyl)-butyl]-amide | CHEMBL69596
TypeSmall organic molecule
Emp. Form.C19H32N4O4S
Mol. Mass.412.547
SMILESCC[C@H](C)[C@H](NC(=O)[C@H](CC(C)C)[C@H](CC)N(O)C=O)C(=O)Nc1nccs1