Reaction Details
TargetStromelysin-1
LigandBDBM50103101
Substrate/Competitorn/a
Meas. Tech.ChEBML_104901
Ki 38±n/a nM
Citation Musso, DLAndersen, MWAndrews, RCAustin, RBeaudet, EJBecherer, JDBubacz, DGBickett, DMChan, JHConway, JGCowan, DJGaul, MDGlennon, KCHedeen, KMLambert, MHLeesnitzer, MAMcDougald, DLMitchell, JLMoss, MLRabinowitz, MHRizzolio, MCSchaller, LTStanford, JBTippin, TWarner, JRWhitesell, LGWiethe, RW N-hydroxyformamide peptidomimetics as TACE/matrix metalloprotease inhibitors: oral activity via P1' isobutyl substitution. Bioorg Med Chem Lett11:2147-51 (2001) Stromelysin-1
Name:Stromelysin-1
Type:Enzyme
Mol. Mass.:53973.13
Organism:Homo sapiens (Human)
Description: P08254
Residue:477
BDBM50103101
NameBDBM50103101
Synonyms:(2R,3S)-3-(Formyl-hydroxy-amino)-2-isobutyl-pentanoic acid [(S)-2-methyl-1-(pyridin-2-ylcarbamoyl)-butyl]-amide | CHEMBL68667
TypeSmall organic molecule
Emp. Form.C21H34N4O4
Mol. Mass.406.5191
SMILESCCC(C)[C@H](NC(=O)[C@H](CC(C)C)[C@H](CC)N(O)C=O)C(=O)Nc1ccccn1