Reaction Details
TargetAlpha-1A/Alpha-1B/Alpha-1D adrenergic receptor
LigandBDBM50080029
Substrate/Competitorn/a
Meas. Tech.ChEMBL_33429 (CHEMBL648825)
Ki 180±n/a nM
Citation Pinard, EAlanine, ABourson, ABüttelmann, BGill, RHeitz, MJaeschke, GMutel, VTrube, GWyler, R Discovery of (R)-1-[2-hydroxy-3-(4-hydroxy-phenyl)-propyl]-4-(4-methyl-benzyl)-piperidin-4-ol: a novel NR1/2B subtype selective NMDA receptor antagonist. Bioorg Med Chem Lett11:2173-6 (2001) Alpha-1A/Alpha-1B/Alpha-1D adrenergic receptor
Name:Alpha-1A/Alpha-1B/Alpha-1D adrenergic receptor
Synonyms:Adrenergic receptor alpha-1
Type:n/a
Mol. Mass.:n/a
Description:ASSAY_ID of ChEMBL is 306566
Components:This complex has 3 components.
Component 1
Name:Alpha-1D adrenergic receptor
Type:Enzyme Catalytic Domain
Mol. Mass.:60485.82
Organism:Homo sapiens (Human)
Description:adrenergic Alpha1D ADRA1D HUMAN::P25100
Residue:572
Component 2
Name:Alpha-1B adrenergic receptor
Synonyms:ADA1B_HUMAN Adrenergic alpha1B Adrenergic receptor alpha Alpha 1B-adrenoreceptor | Alpha-1B adrenergic receptor
Type:Enzyme
Mol. Mass.:56862.13
Organism:Homo sapiens (Human)
Description:P35368
Residue:520
Component 3
Name:Alpha-1A adrenergic receptor
Synonyms:ADA1A_HUMAN ADRA1C Alpha 1A-adrenoceptor Alpha adrenergic receptor 1a Alpha-adrenergic receptor 1c adrenergic Alpha1 | adrenergic Alpha1C
Type:Cell-surface receptors
Mol. Mass.:51511.67
Organism:Homo sapiens (Human)
Description:P35348
Residue:466
BDBM50080029
NameBDBM50080029
Synonyms:4-((1R,2S)-3-(4-benzylpiperidin-1-yl)-1-hydroxy-2-methylpropyl)phenol 4-[(R)-3-(4-Benzyl-piperidin-1-yl)-1-(S)-hydroxy-2-methyl-propyl]-phenol Ro 25-6981 | Ro-25-6981
TypeSmall organic molecule
Emp. Form.C22H29NO2
Mol. Mass.339.4712
SMILESC[C@@H](CN1CCC(Cc2ccccc2)CC1)[C@@H](O)c1ccc(O)cc1