Reaction Details
TargetSphingosine 1-phosphate receptor 1
LigandBDBM23163
Substrate/Competitorn/a
Meas. Tech.ChEMBL_1995311 (CHEMBL4629206)
EC50 4.4±n/a nM
Citation Xiao, QHu, MChen, SJin, JLi, LHu, JXie, PYin, D S1P Bioorg Med Chem Lett30:0 (2020) 
 
Sphingosine 1-phosphate receptor 1
Name:Sphingosine 1-phosphate receptor 1
Type:Enzyme
Mol. Mass.:42836.02
Organism:Homo sapiens (Human)
Description:P21453
Residue:382
BDBM23163
NameBDBM23163
Synonyms:CHEMBL114606 {2-amino-3-hydroxy-2-[2-(4-octylphenyl)ethyl]propoxy}phosphonic acid
TypeSmall organic molecule
Emp. Form.C19H34NO5P
Mol. Mass.387.4507
SMILESCCCCCCCCc1ccc(CCC(N)(CO)COP(O)(O)=O)cc1