Reaction Details
TargetSphingosine 1-phosphate receptor 3
LigandBDBM23163
Substrate/Competitorn/a
Meas. Tech.ChEMBL_1995312 (CHEMBL4629207)
EC50 14±n/a nM
Citation Xiao, QHu, MChen, SJin, JLi, LHu, JXie, PYin, D S1P Bioorg Med Chem Lett30:0 (2020) 
 
Sphingosine 1-phosphate receptor 3
Name:Sphingosine 1-phosphate receptor 3
Type:G Protein-Coupled Receptor (GPCR)
Mol. Mass.:42278.13
Organism:Homo sapiens (Human)
Description:Q99500
Residue:378
BDBM23163
NameBDBM23163
Synonyms:CHEMBL114606 {2-amino-3-hydroxy-2-[2-(4-octylphenyl)ethyl]propoxy}phosphonic acid
TypeSmall organic molecule
Emp. Form.C19H34NO5P
Mol. Mass.387.4507
SMILESCCCCCCCCc1ccc(CCC(N)(CO)COP(O)(O)=O)cc1