Reaction Details
TargetHistamine H1 receptor
LigandBDBM50073179
Substrate/Competitorn/a
Meas. Tech.ChEMBL_1996091 (CHEMBL4629986)
Kd 24±n/a nM
Citation Lall, MSBassyouni, ABradow, JBrown, MBundesmann, MChen, JCiszewski, GHagen, AEHyek, DJenkinson, SLiu, BObach, RSPan, SReilly, USach, NSmaltz, DJSpracklin, DKStarr, JWagenaar, MWalker, GS Late-Stage Lead Diversification Coupled with Quantitative Nuclear Magnetic Resonance Spectroscopy to Identify New Structure-Activity Relationship Vectors at Nanomole-Scale Synthesis: Application to Loratadine, a Human Histamine H J Med Chem63:7268-7292 (2020) 
 
Histamine H1 receptor
Name:Histamine H1 receptor
Type:G Protein-Coupled Receptor (GPCR)
Mol. Mass.:55808.72
Organism:Homo sapiens (Human)
Description:Cell pellets from SK-N-MC cells transfected with human H1 receptor were used in binding assay.
Residue:487
BDBM50073179
NameBDBM50073179
Synonyms:8-Chloro-11-piperidin-4-ylidene-6,11-dihydro-5H-benzo[5,6]cyclohepta[1,2-b]pyridine Clarinex Claritin-D SCH-34117 US9333199, DESLORATADINE (Clarinex)
TypeSmall organic molecule
Emp. Form.C19H19ClN2
Mol. Mass.310.821
SMILESClc1ccc2c(-[#6]-[#6]-c3cccnc3\[#6]-2=[#6]-2/[#6]-[#6]-[#7]-[#6]-[#6]-2)c1