Reaction Details
TargetBromodomain-containing protein 4
LigandBDBM50504160
Substrate/Competitorn/a
Meas. Tech.ChEMBL_1998147 (CHEMBL4650004)
IC50 468±n/a nM
Citation Picaud, SLeonards, KLambert, JPDovey, OWells, CFedorov, OMonteiro, OFujisawa, TWang, CYLingard, HTallant, CNikbin, NGuetzoyan, LIngham, RLey, SVBrennan, PMuller, SSamsonova, AGingras, ACSchwaller, JVassiliou, GKnapp, SFilippakopoulos, P Promiscuous targeting of bromodomains by bromosporine identifies BET proteins as master regulators of primary transcription response in leukemia. Sci Adv2:0 (2016) Bromodomain-containing protein 4
Name:Bromodomain-containing protein 4
Type:Protein
Mol. Mass.:152264.84
Organism:Homo sapiens (Human)
Description:O60885
Residue:1362
BDBM50504160
NameBDBM50504160
Synonyms:CHEMBL3133807 | US11773085, Compound B25
TypeSmall organic molecule
Emp. Form.C17H20N6O4S
Mol. Mass.404.444
SMILESCCOC(=O)Nc1cc(nn2c(C)nnc12)-c1ccc(C)c(NS(C)(=O)=O)c1