Reaction Details
TargetPeregrin
LigandBDBM50504160
Substrate/Competitorn/a
Meas. Tech.ChEMBL_1998154 (CHEMBL4650011)
IC50 141±n/a nM
Citation Picaud, SLeonards, KLambert, JPDovey, OWells, CFedorov, OMonteiro, OFujisawa, TWang, CYLingard, HTallant, CNikbin, NGuetzoyan, LIngham, RLey, SVBrennan, PMuller, SSamsonova, AGingras, ACSchwaller, JVassiliou, GKnapp, SFilippakopoulos, P Promiscuous targeting of bromodomains by bromosporine identifies BET proteins as master regulators of primary transcription response in leukemia. Sci Adv2:0 (2016) Peregrin
Name:Peregrin
Type:PROTEIN
Mol. Mass.:137524.47
Organism:Homo sapiens (Human)
Description:ChEMBL_108054
Residue:1214
BDBM50504160
NameBDBM50504160
Synonyms:CHEMBL3133807 | US11773085, Compound B25
TypeSmall organic molecule
Emp. Form.C17H20N6O4S
Mol. Mass.404.444
SMILESCCOC(=O)Nc1cc(nn2c(C)nnc12)-c1ccc(C)c(NS(C)(=O)=O)c1