Reaction Details
TargetMetabotropic glutamate receptor 4
LigandBDBM50078640
Substrate/Competitorn/a
Meas. Tech.ChEMBL_2012342 (CHEMBL4665920)
EC50 653±n/a nM
Citation Panarese, JDEngers, DWWu, YJGuernon, JMChun, AGregro, ARBender, AMCapstick, RAWieting, JMBronson, JJMacor, JEWestphal, RSoars, MEngers, JEFelts, ASRodriguez, ALEmmitte, KAJones, CKBlobaum, ALConn, PJNiswender, CMHopkins, CRLindsley, CW The discovery of VU0652957 (VU2957, Valiglurax): SAR and DMPK challenges en route to an mGlu Bioorg Med Chem Lett29:342-346 (2019) 
 
Metabotropic glutamate receptor 4
Name:Metabotropic glutamate receptor 4
Type:Protein
Mol. Mass.:101899.95
Organism:Homo sapiens (Human)
Description:Q14833
Residue:912
BDBM50078640
NameBDBM50078640
Synonyms:CHEMBL4755785
TypeSmall organic molecule
Emp. Form.C20H19N5O
Mol. Mass.345.3978
SMILESO=c1n(CC2CCC2)ccc2cc(Nc3n[nH]c4cccnc34)ccc12