Reaction Details
TargetMitogen-activated protein kinase 11/12/13/14
LigandBDBM50044784
Substrate/Competitorn/a
Meas. Tech.ChEMBL_124179 (CHEMBL732095)
IC50 80±n/a nM
Citation Chang, LLSidler, KLCascieri, MAde Laszlo, SKoch, GLi, BMacCoss, MMantlo, NO'Keefe, SPang, MRolando, AHagmann, WK Substituted imidazoles as glucagon receptor antagonists. Bioorg Med Chem Lett11:2549-53 (2001) Mitogen-activated protein kinase 11/12/13/14
Name:Mitogen-activated protein kinase 11/12/13/14
Synonyms:MAP kinase p38
Type:n/a
Mol. Mass.:n/a
Description:ASSAY_ID of ChEMBL is 1935922
Components:This complex has 4 components.
Component 1
Name:Mitogen-activated protein kinase 13
Type:Enzyme
Mol. Mass.:42097.16
Organism:Homo sapiens (Human)
Description:O15264
Residue:365
Component 2
Name:Mitogen-activated protein kinase 11
Synonyms:MAP kinase p38 MK11_HUMAN Mitogen-activated protein kinase p38 beta SAPK2 Stress-activated protein kinase 2 p38-2 p38b
Type:Enzyme Catalytic Domain
Mol. Mass.:41351.73
Organism:Homo sapiens (Human)
Description:gi_20128774
Residue:364
Component 3
Name:Mitogen-activated protein kinase 14
Synonyms:CSAID-binding protein CSBP1 CSPB1 MAP kinase 14 MAP kinase p38 alpha MAPK14 MK14_HUMAN Mitogen-activated protein kinase p38 alpha Stress-activated protein kinase 2a | p38 MAP kinase alpha/beta
Type:Serine/threonine-protein kinase
Mol. Mass.:41286.76
Organism:Homo sapiens (Human)
Description:Q16539
Residue:360
Component 4
Name:Mitogen-activated protein kinase 12
Synonyms:ERK6 MAPK12 Mitogen-activated protein kinase 12 (MAPK12 p38 gamma) Mitogen-activated protein kinase 12 Gamma SAPK3 | p38 delta/gamma
Type:Protein
Mol. Mass.:41938.69
Organism:Homo sapiens (Human)
Description:P53778
Residue:367
BDBM50044784
NameBDBM50044784
Synonyms:CHEBI:79090 US10865384, Compound SB202190
TypeSmall organic molecule
Emp. Form.C20H14FN3O
Mol. Mass.331.3431
SMILESOc1ccc(cc1)-c1nc(c([nH]1)-c1ccncc1)-c1ccc(F)cc1