Reaction Details
TargetLeucine-rich repeat serine/threonine-protein kinase 2
LigandBDBM50448118
Substrate/Competitorn/a
Meas. Tech.ChEMBL_2014754 (CHEMBL4668332)
Ki 0.600000±n/a nM
Citation Hanan, EJLiang, JWang, XBlake, RABlaquiere, NStaben, ST Monomeric Targeted Protein Degraders. J Med Chem63:11330-11361 (2020) 
 
Leucine-rich repeat serine/threonine-protein kinase 2
Name:Leucine-rich repeat serine/threonine-protein kinase 2
Type:Protein
Mol. Mass.:286113.20
Organism:Homo sapiens (Human)
Description:Q5S007
Residue:2527
BDBM50448118
NameBDBM50448118
Synonyms:CHEMBL3122113 US11111235, No. 80 US9932325, Example 80
TypeSmall organic molecule
Emp. Form.C14H16F3N7
Mol. Mass.339.3189
SMILESCNc1nc(Nc2cn(nc2C)C(C)(C)C#N)ncc1C(F)(F)F