Reaction Details
TargetMatrix metalloproteinase-14
LigandBDBM50104722
Substrate/Competitorn/a
Meas. Tech.ChEMBL_106786 (CHEMBL718393)
Ki 340±n/a nM
Citation Schröder, JHenke, AWenzel, HBrandstetter, HStammler, HGStammler, APfeiffer, WDTschesche, H Structure-based design and synthesis of potent matrix metalloproteinase inhibitors derived from a 6H-1,3,4-thiadiazine scaffold. J Med Chem44:3231-43 (2001) Matrix metalloproteinase-14
Name:Matrix metalloproteinase-14
Type:Protein
Mol. Mass.:65900.19
Organism:Homo sapiens (Human)
Description:P50281
Residue:582
BDBM50104722
NameBDBM50104722
Synonyms:(S)-N-(5-(4-bromophenyl)-6H-1,3,4-thiadiazin-2-yl)-2-(phenylsulfonamido)propanamide CHEMBL110750
TypeSmall organic molecule
Emp. Form.C18H17BrN4O3S2
Mol. Mass.481.387
SMILESC[C@H](NS(=O)(=O)c1ccccc1)C(=O)NC1=NN=C(CS1)c1ccc(Br)cc1